{"text_format":"1","workbook":"xlsx","n_sheets":4,"sheets":["INPUT","LISTS","DATAVERWERKING","Sheet1"],"not_rendered":{"charts":10,"images":3,"macros":1,"external_links":0,"defined_names":7,"comments":1,"pivot_tables":0},"unopened":[],"bounds":{"document_bytes":16777216,"sheet_cells":100000,"rows_first":2000,"rows_last":500,"rows_between":2000,"halvings":0,"cell_chars":16384,"cell_head_chars":4096},"cells_cut":0,"cells_raw":0,"read":"whole","date_system":"1900"}

{"sheet":"INPUT","index":0,"n_rows":56,"n_cols":6,"rows_kept":56,"cut":false,"hidden":false,"merged":[]}
[]
[]
[]
[]
[null,"BASISGEGEVENS"]
[null,"DOSSIER"]
[null,"Naam dossierbeheerder",null,null,null,{"$f":"IF(D7=\"\",3,IF(D7=\"antwoord onbekend\",2,1))","v":3}]
[null,"Namen betrokken personen",null,null,null,{"$f":"IF(D8=\"\",3,IF(D8=\"antwoord onbekend\",2,1))","v":3}]
[null,"Datum opstart dossier",null,null,null,3]
[null,"LOCATIE"]
[null,"Naam",null,null,null,{"$f":"IF(D11=\"\",3,IF(D11=\"antwoord onbekend\",2,1))","v":3}]
[null,"Adres",null,null,null,{"$f":"IF(D12=\"\",3,IF(D12=\"antwoord onbekend\",2,1))","v":3}]
[null,"Huidige eigenaar",null,null,null,3]
[]
[null,"RUIMTELIJK KENMERKEN"]
[null,"Zijn er kwetsbare functies binnen een straal van 200 meter rond de site?","belangrijk","kies",null,{"$f":"IF(D16=\"kies\",3,IF(D16=\"antwoord onbekend\",2,1))","v":3}]
[null,"Welke stedenbouwkundige bestemming heeft de site?","belangrijk","kies",null,{"$f":"IF(D17=\"kies\",3,IF(D17=\"antwoord onbekend\",2,1))","v":3}]
[null,"Ligt de site in een omgeving met een hoge of lage ruimtelijke dynamiek?","belangrijk","kies",null,3]
[null,"In welk type buurt ligt de site?","belangrijk","kies",null,3]
[null,"Hoe groot is de site?","belangrijk","kies",null,3]
[null,"Wat is de actuele graad van bebouwde oppervlakte op de site?",null,"kies",null,3]
[null,"Is er onroerend erfgoed op de site aanwezig?",null,"kies",null,3]
[null,"In welke staat is de site vandaag?",null,"kies",null,3]
[null,"Is er op de site voldoende ruimte om te bufferen?","belangrijk","kies",null,3]
[null,"In welke mate kan de bestaande toestand behouden worden?","belangrijk","kies",null,3]
[null,"Is de site zo georganiseerd dat er draagvlak kan zijn voor opslag in open lucht?","belangrijk","kies",null,3]
[null,"Kan het aanwezige erfgoed op de site behouden worden om nieuwe activiteiten mogelijk te maken?","belangrijk","kies",null,3]
[null,"Is er in de omgeving van de site een grote druk vanuit andere functies dan bedrijvigheid?","belangrijk","Vanuit de omgeving is er een grote druk door andere functies dan bedrijvigheid",null,1]
[]
[null,"SOCIALE KENMERKEN"]
[null,"Zijn er in de buurt al bedrijven actief met eenzelfde schaal als de site?","belangrijk","kies",null,{"$f":"IF(D31=\"kies\",3,IF(D31=\"antwoord onbekend\",2,1))","v":3}]
[null,"Zijn er vanuit de buurt in het verleden reeds klachten gekomen rond bedrijvigheid?","belangrijk","kies",null,3]
[null,"Is er in de buurt van de site nood aan bijkomende ruimte (vb. voor parkeren, spelen, …)?","belangrijk","kies",null,3]
[]
[null,"ECONOMISCHE KENMERKEN"]
[null,"Is het aantal ambachtelijke bedrijven en kmo's in de kern de afgelopen jaren afgenomen?","belangrijk","kies",null,{"$f":"IF(D36=\"kies\",3,IF(D36=\"antwoord onbekend\",2,1))","v":3}]
[null,"Is het aantal commerciële diensten en voorzieningen in de kern de afgelopen jaren afgenomen?","belangrijk","kies",null,3]
[null,"Is er in de gemeente nood aan bijkomende ruimte voor ambachtelijke bedrijven of kmo's?","belangrijk","kies",null,3]
[null,"Zijn er in de buurt tekenen van verpaupering en stijgende werkloosheid?","belangrijk","In de buurt is er al een sterke verpaupering en een bovengemiddelde werkloosheid aanwezig",null,1]
[]
[null,"KENMERKEN LEEFMILIEU"]
[null,"Het groot mag de hindercontour zijn voor wat betreft stof","belangrijk","kies",null,{"$f":"IF(D42=\"kies\",3,IF(D42=\"antwoord onbekend\",2,1))","v":3}]
[null,"Het groot mag de hindercontour zijn voor wat betreft geur?","belangrijk","kies",null,3]
[null,"Het groot mag de hindercontour zijn voor wat betreft lichtvervuiling?","belangrijk","kies",null,3]
[null,"Het groot mag de hindercontour zijn voor wat betreft geluid?","belangrijk","kies",null,3]
[null,"Het groot mag de hindercontour zijn voor wat betreft trillingen?","belangrijk","kies",null,3]
[]
[null,"MOBILITEITSKENMERKEN"]
[null,"Ligt de site op wandelafstand van openbaar vervoer?","belangrijk","op wandelafstand van een bushalte en een station",null,1]
[null,"Hoe ver ligt de site van het hogere wegennet?","belangrijk","kies",null,3]
[null,"Wat is de kwaliteit van het ontsluitingstraject?","belangrijk","kies",null,3]
[null,"Hoeveel vrachtbewegingen zijn er voor de buurt haalbaar, binnen de courante werkuren?","belangrijk","kies",null,3]
[null,"Hoeveel vrachtbewegingen zijn er voor de buurt haalbaar, 's morgens en 's avonds (samengeteld)?","belangrijk","kies",null,3]
[null,"Hoeveel vrachtbewegingen zijn er voor de buurt haalbaar, 's nachts?","belangrijk","kies",null,3]
[null,"Is er op de site plaats (of kan er plaats gemaakt worden) om te laden en te lossen?","belangrijk","kies",null,3]
[null,"Is er op de site plaats (of kan er plaats gemaakt worden) om te parkeren?","belangrijk","kies",null,3]

{"sheet":"LISTS","index":1,"n_rows":227,"n_cols":5,"rows_kept":227,"cut":false,"hidden":true,"merged":[]}
["R01 - kwestsbare functies"]
["kies",null,0]
["neen, er zijn geen kwestbare functies",null,0,null,"In een straal van 200 meter rond de site zijn er geen kwetsbare functies"]
["ja, er zijn kwetsbare functies",null,5,null,"In een straal van 200 meter zijn er kwetsbare functies"]
["het is niet bekend of er in een straal van 200 meter kwetsbare functies zijn",null,"x",null,"Het is niet bekend of er in een straal van 200 meter kwetsbare functies zijn"]
["R02 - bestemming"]
["kies",null,0]
["industriegebied (paars)",null,0,null,"De site heeft als stedenbouwkundige bestemming \"industriegebied\""]
["woongebied (rood)",null,5,null,"De site heeft als stedenbouwkundige bestemming \"woongebied\""]
["andere",null,5,null,"De site heeft een andere stedenbouwkundige bestemming dan \"industriegebied\" of \"woongebied\""]
["R03 - dynamiek"]
["kies",null,0]
["lage ruimtelijke dynamiek",null,5,null,{"$f":"CONCATENATE(\"De site ligt in een omgeving met\",\" \",_R03[[#This Row],[R03 - dynamiek]])","v":"De site ligt in een omgeving met lage ruimtelijke dynamiek"}]
["gemiddelde ruimtelijke dynamiek",null,2.5,null,{"$f":"CONCATENATE(\"De site ligt in een omgeving met\",\" \",_R03[[#This Row],[R03 - dynamiek]])","v":"De site ligt in een omgeving met gemiddelde ruimtelijke dynamiek"}]
["hoge ruimtelijke dynamiek",null,0,null,{"$f":"CONCATENATE(\"De site ligt in een omgeving met\",\" \",_R03[[#This Row],[R03 - dynamiek]])","v":"De site ligt in een omgeving met hoge ruimtelijke dynamiek"}]
["R04 - type buurt"]
["kies",null,0]
["het gemengd weefsel langs invalsweg",null,0,null,{"$f":"CONCATENATE(\"De site ligt in\",\" \",_R04[[#This Row],[R04 - type buurt]])","v":"De site ligt in het gemengd weefsel langs invalsweg"}]
["de 19de eeuwse rand",null,2.5,null,{"$f":"CONCATENATE(\"De site ligt in\",\" \",_R04[[#This Row],[R04 - type buurt]])","v":"De site ligt in de 19de eeuwse rand"}]
["de groene / residentiële rand",null,2.5,null,{"$f":"CONCATENATE(\"De site ligt in\",\" \",_R04[[#This Row],[R04 - type buurt]])","v":"De site ligt in de groene / residentiële rand"}]
["het historisch centrum",null,5,null,{"$f":"CONCATENATE(\"De site ligt in\",\" \",_R04[[#This Row],[R04 - type buurt]])","v":"De site ligt in het historisch centrum"}]
["R05 - oppervlakte"]
["kies",null,0]
["< 250 m²",null,0,null,"De site is kleiner dan 250 m²"]
["< 500 m²",null,{"$f":"5/6","v":0.83333333333333337},null,"De site is kleiner dan 500 m²"]
["< 1000 m²",null,{"$f":"C25+5/6","v":1.6666666666666667},null,"De site is kleiner dan 1000 m²"]
["< 2000 m²",null,{"$f":"C26+5/6","v":2.5},null,"De site is kleiner dan 2000 m²"]
["< 5000 m²",null,{"$f":"C27+5/6","v":3.3333333333333335},null,"De site is kleiner dan 5000 m²"]
["< 10.000 m²",null,{"$f":"C28+5/6","v":4.166666666666667},null,"De site is kleiner dan 10.000 m²"]
["> 10.000 m²",null,{"$f":"C29+5/6","v":5},null,"De site is groter dan 10.000 m²"]
["R06 - bebouwingsgraad"]
["kies"]
["circa 0 procent",null,null,null,"De site is niet bebouwd"]
["circa 25 procent",null,null,null,"De site is voor ongeveer 25 procent bebouwd"]
["circa 50 procent",null,null,null,"De site is voor ongeveer de helft bebouwd"]
["circa 75 procent",null,null,null,"De site is voor ongeveer 75 procent bebouwd"]
["circa 100 procent",null,null,null,"De site is volledig bebouwd"]
["de bebouwingsgraad van de site is niet bekend",null,null,null,"De bebouwingsgraad van de site is niet bekend"]
["R07 - aanwezigheid erfgoed"]
["kies"]
["Er is onroerend erfgoed aanwezig",null,null,null,"Op de site is er onroerend erfgoed aanwezig"]
["Er is geen onroerend erfgoed aanwezig",null,null,null,"Op de site is er geen onroerend erfgoed aanwezig"]
["het is niet bekend of er op de site onroerend erfgoed aanwezig is",null,null,null,"Het is niet bekend of er op de site onroerend erfgoed aanwezig is"]
["R08 - staat van de site"]
["kies"]
["de site is nieuw en niet verwaarloosd",null,null,null,"De site is nieuw en niet verwaarloosd"]
["de site is nieuw maar verwaarloosd",null,null,null,"De site is nieuw maar wel verwaarloosd"]
["de site is verouderd maar niet verwaarloosd",null,null,null,"De site is verouderd maar niet verwaarloosd"]
["de site is verouderd en verwaarloosd",null,null,null,"De site is verouderd en ook verwaarloosd"]
["het is niet bekend in welke mate de site verouderd en/of verwaarloosd is",null,null,null,"Het is niet bekend in welke mate de site verouderd en/of verwaarloosd is"]
["R09 - buffering"]
["kies",null,0]
["ja, volledig",null,0,null,"De site biedt voldoende ruimte om te bufferen"]
["ja, gedeeltelijk",null,2.5,null,"De site biedt gedeeltelijke ruimte om te bufferen"]
["neen, geen buffering op eigen terrein mogelijk",null,5,null,"De site biedt geen mogelijkheden om te bufferen"]
["het is niet bekend of de site mogelijkheden biedt om te bufferen",null,"x",null,"Het is niet bekend of de site mogelijkheden biedt om te bufferen"]
["R11 - inrichtingsplannen"]
["kies",null,0]
["De site kan ongewijzigd blijven",null,{"$f":"IF(OR(INPUT!$D$23=$A$45,INPUT!$D$23=$A$47,INPUT!$D$23=$A$49),5,0)","v":5},null,{"$f":"_R11[[#This Row],[R11 - inrichtingsplannen]]","v":"De site kan ongewijzigd blijven"}]
["De site moet opgefrist worden",null,{"$f":"IF(OR(INPUT!$D$23=$A$45,INPUT!$D$23=$A$47,INPUT!$D$23=$A$49),2.5,0)","v":2.5},null,{"$f":"_R11[[#This Row],[R11 - inrichtingsplannen]]","v":"De site moet opgefrist worden"}]
["De site moet volledig worden vernieuwd",null,{"$f":"IF(OR(INPUT!$D$23=$A$45,INPUT!$D$23=$A$47,INPUT!$D$23=$A$49),0,5)","v":0},null,{"$f":"_R11[[#This Row],[R11 - inrichtingsplannen]]","v":"De site moet volledig worden vernieuwd"}]
["Het is niet bekend of er vernieuwingswerken op de site nodig zijn",null,"x",null,{"$f":"_R11[[#This Row],[R11 - inrichtingsplannen]]","v":"Het is niet bekend of er vernieuwingswerken op de site nodig zijn"}]
["R12 - opslag"]
["kies",null,0]
["Opslag in open lucht kan zonder bijkomende randvoorwaarden",null,0,null,{"$f":"_R12[[#This Row],[R12 - opslag]]","v":"Opslag in open lucht kan zonder bijkomende randvoorwaarden"}]
["Opslag in open lucht is mits bepaalde randvoorwaarden mogelijk",null,1,null,{"$f":"_R12[[#This Row],[R12 - opslag]]","v":"Opslag in open lucht is mits bepaalde randvoorwaarden mogelijk"}]
["Opslag in open lucht is onder geen beding mogelijk",null,5,null,{"$f":"_R12[[#This Row],[R12 - opslag]]","v":"Opslag in open lucht is onder geen beding mogelijk"}]
["het is niet bekend of opslag in open lucht mogelijk is",null,"x",null,{"$f":"_R12[[#This Row],[R12 - opslag]]","v":"het is niet bekend of opslag in open lucht mogelijk is"}]
["R13 - behoud erfgoed"]
["kies",null,0]
["Het erfgoed kan mits eenvoudige ingrepen behouden worden",null,0,null,{"$f":"_R13[[#This Row],[R13 - behoud erfgoed]]","v":"Het erfgoed kan mits eenvoudige ingrepen behouden worden"}]
["Het erfgoed moet wellicht worden aangetast om bedrijfsactiviteiten mogelijk te maken",null,2.5,null,{"$f":"_R13[[#This Row],[R13 - behoud erfgoed]]","v":"Het erfgoed moet wellicht worden aangetast om bedrijfsactiviteiten mogelijk te maken"}]
["Het erfgoed moet hoogst waarschijnlijk verdwijnen om bedrijfsactiviteiten mogelijk te maken",null,5,null,{"$f":"_R13[[#This Row],[R13 - behoud erfgoed]]","v":"Het erfgoed moet hoogst waarschijnlijk verdwijnen om bedrijfsactiviteiten mogelijk te maken"}]
["Het is niet bekend in welke mate het onroerend erfgoed kan worden behouden",null,"x"]
["R14 - druk"]
["kies"]
["Vanuit de omgeving is er een grote druk door andere functies dan bedrijvigheid",null,5,null,{"$f":"_R14[[#This Row],[R14 - druk]]","v":"Vanuit de omgeving is er een grote druk door andere functies dan bedrijvigheid"}]
["Vanuit de omgeving is er een beperkte druk door andere functies dan bedrijvigheid",null,2.5,null,{"$f":"_R14[[#This Row],[R14 - druk]]","v":"Vanuit de omgeving is er een beperkte druk door andere functies dan bedrijvigheid"}]
["Vanuit de omgeving is er geen druk door andere functies dan bedrijvigheid",null,0,null,{"$f":"_R14[[#This Row],[R14 - druk]]","v":"Vanuit de omgeving is er geen druk door andere functies dan bedrijvigheid"}]
["Het is niet bekend of er vanuit de omgeving druk is door andere functies dan bedrijvigheid",null,"x",null,{"$f":"_R14[[#This Row],[R14 - druk]]","v":"Het is niet bekend of er vanuit de omgeving druk is door andere functies dan bedrijvigheid"}]
{"$rows_left_out":148}
{"sheet":"DATAVERWERKING","index":2,"n_rows":84,"n_cols":10,"rows_kept":84,"cut":false,"hidden":true,"merged":[[68,9,75,9],[25,9,27,9],[53,9,57,9],[2,9,14,9],[38,9,41,9]]}
[]
[null,{"$f":"INPUT!B15","v":"RUIMTELIJK KENMERKEN"},null,null,null,"score","belang","totaal"]
[null,{"$f":"INPUT!B16","v":"Zijn er kwetsbare functies binnen een straal van 200 meter rond de site?"},{"$f":"INPUT!C16","v":"belangrijk"},{"$f":"INPUT!D16","v":"kies"},null,{"$f":"VLOOKUP(D3,Range_vlookup,3,FALSE)","v":0},{"$f":"VLOOKUP(C3,Range_vlookup,3,FALSE)","v":1},{"$f":"IF(F3=\"x\",\"x\",F3*G3)","v":0},null,{"$f":"H16*(D16/G16)/D16","v":0.5}]
[null,{"$f":"INPUT!B17","v":"Welke stedenbouwkundige bestemming heeft de site?"},{"$f":"INPUT!C17","v":"belangrijk"},{"$f":"INPUT!D17","v":"kies"},null,{"$f":"VLOOKUP(D4,Range_vlookup,3,FALSE)","v":0},{"$f":"VLOOKUP(C4,Range_vlookup,3,FALSE)","v":1},{"$f":"IF(F4=\"x\",\"x\",F4*G4)","v":0}]
[null,{"$f":"INPUT!B18","v":"Ligt de site in een omgeving met een hoge of lage ruimtelijke dynamiek?"},{"$f":"INPUT!C18","v":"belangrijk"},{"$f":"INPUT!D18","v":"kies"},null,{"$f":"VLOOKUP(D5,Range_vlookup,3,FALSE)","v":0},{"$f":"VLOOKUP(C5,Range_vlookup,3,FALSE)","v":1},{"$f":"IF(F5=\"x\",\"x\",F5*G5)","v":0}]
[null,{"$f":"INPUT!B19","v":"In welk type buurt ligt de site?"},{"$f":"INPUT!C19","v":"belangrijk"},{"$f":"INPUT!D19","v":"kies"},null,{"$f":"VLOOKUP(D6,Range_vlookup,3,FALSE)","v":0},{"$f":"VLOOKUP(C6,Range_vlookup,3,FALSE)","v":1},0]
[null,{"$f":"INPUT!B20","v":"Hoe groot is de site?"},{"$f":"INPUT!C20","v":"belangrijk"},{"$f":"INPUT!D20","v":"kies"},null,{"$f":"VLOOKUP(D7,Range_vlookup,3,FALSE)","v":0},{"$f":"VLOOKUP(C7,Range_vlookup,3,FALSE)","v":1},0]
[null,{"$f":"INPUT!B21","v":"Wat is de actuele graad van bebouwde oppervlakte op de site?"},null,{"$f":"INPUT!D21","v":"kies"}]
[null,{"$f":"INPUT!B22","v":"Is er onroerend erfgoed op de site aanwezig?"},null,{"$f":"INPUT!D22","v":"kies"}]
[null,{"$f":"INPUT!B23","v":"In welke staat is de site vandaag?"},null,{"$f":"INPUT!D23","v":"kies"}]
[null,{"$f":"INPUT!B24","v":"Is er op de site voldoende ruimte om te bufferen?"},{"$f":"INPUT!C24","v":"belangrijk"},{"$f":"INPUT!D24","v":"kies"},null,{"$f":"VLOOKUP(D11,Range_vlookup,3,FALSE)","v":0},{"$f":"VLOOKUP(C11,Range_vlookup,3,FALSE)","v":1},0]
[null,{"$f":"INPUT!B25","v":"In welke mate kan de bestaande toestand behouden worden?"},{"$f":"INPUT!C25","v":"belangrijk"},{"$f":"INPUT!D25","v":"kies"},null,{"$f":"VLOOKUP(D12,Range_vlookup,3,FALSE)","v":0},{"$f":"VLOOKUP(C12,Range_vlookup,3,FALSE)","v":1},0]
[null,{"$f":"INPUT!B26","v":"Is de site zo georganiseerd dat er draagvlak kan zijn voor opslag in open lucht?"},{"$f":"INPUT!C26","v":"belangrijk"},{"$f":"INPUT!D26","v":"kies"},null,{"$f":"VLOOKUP(D13,Range_vlookup,3,FALSE)","v":0},{"$f":"VLOOKUP(C13,Range_vlookup,3,FALSE)","v":1},0]
[null,{"$f":"INPUT!B27","v":"Kan het aanwezige erfgoed op de site behouden worden om nieuwe activiteiten mogelijk te maken?"},{"$f":"INPUT!C27","v":"belangrijk"},{"$f":"INPUT!D27","v":"kies"},null,{"$f":"VLOOKUP(D14,Range_vlookup,3,FALSE)","v":0},{"$f":"VLOOKUP(C14,Range_vlookup,3,FALSE)","v":1},0]
[null,{"$f":"INPUT!B28","v":"Is er in de omgeving van de site een grote druk vanuit andere functies dan bedrijvigheid?"},{"$f":"INPUT!C28","v":"belangrijk"},{"$f":"INPUT!D28","v":"Vanuit de omgeving is er een grote druk door andere functies dan bedrijvigheid"},null,{"$f":"VLOOKUP(D15,Range_vlookup,3,FALSE)","v":5},{"$f":"VLOOKUP(C15,Range_vlookup,3,FALSE)","v":1},5]
[null,null,null,{"$f":"IF(D9=LISTS!A41,10,9)","v":9},null,{"$f":"SUM(F3:F15)","v":5},{"$f":"SUM(G3:G15)","v":10},{"$f":"SUM(H3:H15)","v":5}]
[null,null,null,null,null,"schaal","verdeling","score"]
[null,null,null,null,null,0,20,{"$f":"J3/5","v":0.1}]
[null,null,null,null,null,1,20,0.01]
[null,null,null,null,null,2,20,{"$f":"H23-H19-H18","v":0.89}]
[null,null,null,null,null,3,20,0]
[null,null,null,null,null,4,20,0]
[null,null,null,null,null,5,100,1]
[]
[null,{"$f":"INPUT!B30","v":"SOCIALE KENMERKEN"}]
[null,{"$f":"INPUT!B31","v":"Zijn er in de buurt al bedrijven actief met eenzelfde schaal als de site?"},{"$f":"INPUT!C31","v":"belangrijk"},{"$f":"INPUT!D31","v":"kies"},null,{"$f":"VLOOKUP(D26,Range_vlookup,3,FALSE)","v":0},{"$f":"VLOOKUP(C26,Range_vlookup,3,FALSE)","v":1},{"$f":"IF(F26=\"x\",\"x\",F26*G26)","v":0},null,{"$f":"H29/G29","v":0}]
[null,{"$f":"INPUT!B32","v":"Zijn er vanuit de buurt in het verleden reeds klachten gekomen rond bedrijvigheid?"},{"$f":"INPUT!C32","v":"belangrijk"},{"$f":"INPUT!D32","v":"kies"},null,{"$f":"VLOOKUP(D27,Range_vlookup,3,FALSE)","v":0},{"$f":"VLOOKUP(C27,Range_vlookup,3,FALSE)","v":1},0]
[null,{"$f":"INPUT!B33","v":"Is er in de buurt van de site nood aan bijkomende ruimte (vb. voor parkeren, spelen, …)?"},{"$f":"INPUT!C33","v":"belangrijk"},{"$f":"INPUT!D33","v":"kies"},null,{"$f":"VLOOKUP(D28,Range_vlookup,3,FALSE)","v":0},{"$f":"VLOOKUP(C28,Range_vlookup,3,FALSE)","v":1},0]
[null,null,null,{"$f":"IF(D14=LISTS!A48,9,8)","v":8},null,{"$f":"SUM(F26:F28)","v":0},{"$f":"SUM(G26:G28)","v":3},{"$f":"SUM(H26:H28)","v":0}]
[null,null,null,null,null,"schaal","verdeling","score"]
[null,null,null,null,null,0,20,{"$f":"J26/5","v":0}]
[null,null,null,null,null,1,20,0.01]
[null,null,null,null,null,2,20,{"$f":"H36-H32-H31","v":0.99}]
[null,null,null,null,null,3,20,0]
[null,null,null,null,null,4,20,0]
[null,null,null,null,null,5,100,1]
[]
[null,{"$f":"INPUT!B35","v":"ECONOMISCHE KENMERKEN"}]
[null,{"$f":"INPUT!B36","v":"Is het aantal ambachtelijke bedrijven en kmo's in de kern de afgelopen jaren afgenomen?"},{"$f":"INPUT!C36","v":"belangrijk"},{"$f":"INPUT!D36","v":"kies"},null,{"$f":"VLOOKUP(D39,Range_vlookup,3,FALSE)","v":0},{"$f":"VLOOKUP(C39,Range_vlookup,3,FALSE)","v":1},{"$f":"IF(F39=\"x\",\"x\",F39*G39)","v":0},null,{"$f":"H43/G43","v":0}]
[null,{"$f":"INPUT!B37","v":"Is het aantal commerciële diensten en voorzieningen in de kern de afgelopen jaren afgenomen?"},{"$f":"INPUT!C37","v":"belangrijk"},{"$f":"INPUT!D37","v":"kies"},null,{"$f":"VLOOKUP(D40,Range_vlookup,3,FALSE)","v":0},{"$f":"VLOOKUP(C40,Range_vlookup,3,FALSE)","v":1},{"$f":"IF(F40=\"x\",\"x\",F40*G40)","v":0}]
[null,{"$f":"INPUT!B38","v":"Is er in de gemeente nood aan bijkomende ruimte voor ambachtelijke bedrijven of kmo's?"},{"$f":"INPUT!C38","v":"belangrijk"},{"$f":"INPUT!D38","v":"kies"},null,{"$f":"VLOOKUP(D41,Range_vlookup,3,FALSE)","v":0},{"$f":"VLOOKUP(C41,Range_vlookup,3,FALSE)","v":1},0]
[null,{"$f":"INPUT!B39","v":"Zijn er in de buurt tekenen van verpaupering en stijgende werkloosheid?"},{"$f":"INPUT!C39","v":"belangrijk"},{"$f":"INPUT!D39","v":"In de buurt is er al een sterke verpaupering en een bovengemiddelde werkloosheid aanwezig"},null,{"$f":"VLOOKUP(D42,Range_vlookup,3,FALSE)","v":0},{"$f":"VLOOKUP(C42,Range_vlookup,3,FALSE)","v":1},0]
[null,null,null,null,null,{"$f":"SUM(F39:F42)","v":0},{"$f":"SUM(G39:G42)","v":4},{"$f":"SUM(H39:H42)","v":0}]
[null,null,null,null,null,"schaal","verdeling","score"]
[null,null,null,null,null,0,20,{"$f":"J39/5","v":0}]
[null,null,null,null,null,1,20,0.01]
[null,null,null,null,null,2,20,{"$f":"H50-H46-H45","v":0.99}]
[null,null,null,null,null,3,20,0]
[null,null,null,null,null,4,20,0]
[null,null,null,null,null,5,100,1]
[]
[]
[null,{"$f":"INPUT!B41","v":"KENMERKEN LEEFMILIEU"}]
[null,{"$f":"INPUT!B42","v":"Het groot mag de hindercontour zijn voor wat betreft stof"},{"$f":"INPUT!C42","v":"belangrijk"},{"$f":"INPUT!D42","v":"kies"},null,{"$f":"VLOOKUP(D54,Range_vlookup,3,FALSE)","v":0},{"$f":"VLOOKUP(C54,Range_vlookup,3,FALSE)","v":1},{"$f":"IF(F54=\"x\",\"x\",F54*G54)","v":0},null,{"$f":"H59/G59","v":0}]
[null,{"$f":"INPUT!B43","v":"Het groot mag de hindercontour zijn voor wat betreft geur?"},{"$f":"INPUT!C43","v":"belangrijk"},{"$f":"INPUT!D43","v":"kies"},null,0,1,{"$f":"IF(F55=\"x\",\"x\",F55*G55)","v":0}]
[null,{"$f":"INPUT!B44","v":"Het groot mag de hindercontour zijn voor wat betreft lichtvervuiling?"},{"$f":"INPUT!C44","v":"belangrijk"},{"$f":"INPUT!D44","v":"kies"},null,0,1,0]
[null,{"$f":"INPUT!B45","v":"Het groot mag de hindercontour zijn voor wat betreft geluid?"},{"$f":"INPUT!C45","v":"belangrijk"},{"$f":"INPUT!D45","v":"kies"},null,0,1,{"$f":"IF(F57=\"x\",\"x\",F57*G57)","v":0}]
[null,{"$f":"INPUT!B46","v":"Het groot mag de hindercontour zijn voor wat betreft trillingen?"},{"$f":"INPUT!C46","v":"belangrijk"},{"$f":"INPUT!D46","v":"kies"},null,0,1,{"$f":"IF(F58=\"x\",\"x\",F58*G58)","v":0}]
[null,null,null,null,null,{"$f":"SUM(F54:F58)","v":0},{"$f":"SUM(G54:G58)","v":5},{"$f":"SUM(H54:H58)","v":0}]
[null,null,null,null,null,"schaal","verdeling","score"]
[null,null,null,null,null,0,20,{"$f":"J54/5","v":0}]
[null,null,null,null,null,1,20,0.01]
[null,null,null,null,null,2,20,{"$f":"H66-H62-H61","v":0.99}]
[null,null,null,null,null,3,20,0]
[null,null,null,null,null,4,20,0]
[null,null,null,null,null,5,100,1]
[]
[null,{"$f":"INPUT!B48","v":"MOBILITEITSKENMERKEN"}]
[null,{"$f":"INPUT!B49","v":"Ligt de site op wandelafstand van openbaar vervoer?"},{"$f":"INPUT!C49","v":"belangrijk"},{"$f":"INPUT!D49","v":"op wandelafstand van een bushalte en een station"},null,{"$f":"VLOOKUP(D69,Range_vlookup,3,FALSE)","v":0},{"$f":"VLOOKUP(C69,Range_vlookup,3,FALSE)","v":1},{"$f":"IF(F69=\"x\",\"x\",F69*G69)","v":0},null,{"$f":"H77/G77","v":0}]
[null,{"$f":"INPUT!B50","v":"Hoe ver ligt de site van het hogere wegennet?"},{"$f":"INPUT!C50","v":"belangrijk"},{"$f":"INPUT!D50","v":"kies"},null,{"$f":"VLOOKUP(D70,Range_vlookup,3,FALSE)","v":0},{"$f":"VLOOKUP(C70,Range_vlookup,3,FALSE)","v":1},{"$f":"IF(F70=\"x\",\"x\",F70*G70)","v":0}]
[null,{"$f":"INPUT!B51","v":"Wat is de kwaliteit van het ontsluitingstraject?"},{"$f":"INPUT!C51","v":"belangrijk"},{"$f":"INPUT!D51","v":"kies"},null,{"$f":"VLOOKUP(D71,Range_vlookup,3,FALSE)","v":0},{"$f":"VLOOKUP(C71,Range_vlookup,3,FALSE)","v":1},0]
[null,{"$f":"INPUT!B52","v":"Hoeveel vrachtbewegingen zijn er voor de buurt haalbaar, binnen de courante werkuren?"},{"$f":"INPUT!C52","v":"belangrijk"},{"$f":"INPUT!D52","v":"kies"},null,{"$f":"VLOOKUP(D72,Range_vlookup,3,FALSE)","v":0},{"$f":"VLOOKUP(C72,Range_vlookup,3,FALSE)","v":1},{"$f":"IF(F72=\"x\",\"x\",F72*G72)","v":0}]
[null,{"$f":"INPUT!B53","v":"Hoeveel vrachtbewegingen zijn er voor de buurt haalbaar, 's morgens en 's avonds (samengeteld)?"},{"$f":"INPUT!C53","v":"belangrijk"},{"$f":"INPUT!D53","v":"kies"},null,0,1,0]
[null,{"$f":"INPUT!B54","v":"Hoeveel vrachtbewegingen zijn er voor de buurt haalbaar, 's nachts?"},{"$f":"INPUT!C54","v":"belangrijk"},{"$f":"INPUT!D54","v":"kies"},null,0,1,0]
[null,{"$f":"INPUT!B55","v":"Is er op de site plaats (of kan er plaats gemaakt worden) om te laden en te lossen?"},{"$f":"INPUT!C55","v":"belangrijk"},{"$f":"INPUT!D55","v":"kies"},null,0,1,0]
[null,{"$f":"INPUT!B56","v":"Is er op de site plaats (of kan er plaats gemaakt worden) om te parkeren?"},{"$f":"INPUT!C56","v":"belangrijk"},{"$f":"INPUT!D56","v":"kies"},null,0,1,0]
[null,null,null,null,null,{"$f":"SUM(F69:F76)","v":0},{"$f":"SUM(G69:G76)","v":8},{"$f":"SUM(H69:H76)","v":0}]
[null,null,null,null,null,"schaal","verdeling","score"]
[null,null,null,null,null,0,20,{"$f":"J69/5","v":0}]
[null,null,null,null,null,1,20,0.01]
{"$rows_left_out":5}
{"sheet":"Sheet1","index":3,"n_rows":0,"n_cols":0,"rows_kept":0,"cut":false,"hidden":false,"merged":[]}