{"text_format":"1","workbook":"xlsx","n_sheets":5,"sheets":["WELKOM","INPUT","RESULTAAT","LISTS","DATAVERWERKING"],"not_rendered":{"charts":15,"images":3,"macros":1,"external_links":0,"defined_names":8,"comments":2,"pivot_tables":0},"unopened":[],"bounds":{"document_bytes":16777216,"sheet_cells":100000,"rows_first":2000,"rows_last":500,"rows_between":2000,"halvings":0,"cell_chars":16384,"cell_head_chars":4096},"cells_cut":0,"cells_raw":0,"read":"whole","date_system":"1900"}

{"sheet":"WELKOM","index":0,"n_rows":0,"n_cols":0,"rows_kept":0,"cut":false,"hidden":false,"merged":[]}

{"sheet":"INPUT","index":1,"n_rows":86,"n_cols":6,"rows_kept":86,"cut":false,"hidden":false,"merged":[]}
[]
[]
[]
[]
[null,"BASISGEGEVENS"]
[null,"DOSSIER"]
[null,"Naam dossierbeheerder",null,null,null,{"$f":"IF(D7=\"\",3,IF(D7=\"antwoord onbekend\",2,1))","v":3}]
[null,"Namen betrokken personen",null,null,null,{"$f":"IF(D8=\"\",3,IF(D8=\"antwoord onbekend\",2,1))","v":3}]
[null,"Datum opstart dossier",null,null,null,3]
[null,"LOCATIE"]
[null,"Naam",null,null,null,{"$f":"IF(D11=\"\",3,IF(D11=\"antwoord onbekend\",2,1))","v":3}]
[null,"Adres",null,null,null,{"$f":"IF(D12=\"\",3,IF(D12=\"antwoord onbekend\",2,1))","v":3}]
[null,"Huidige eigenaar",null,null,null,3]
[null,"GEÏNTERESSEERDE PARTIJ"]
[null,"Naam",null,null,null,{"$f":"IF(D15=\"\",3,IF(D15=\"antwoord onbekend\",2,1))","v":3}]
[null,"Adres",null,null,null,{"$f":"IF(D16=\"\",3,IF(D16=\"antwoord onbekend\",2,1))","v":3}]
[null,"Contactpersoon",null,null,null,3]
[null,"Telefoon",null,null,null,{"$f":"IF(D18=\"\",3,IF(D18=\"antwoord onbekend\",2,1))","v":3}]
[null,"Email",null,null,null,3]
[]
[null,"RUIMTELIJK KENMERKEN"]
[null,"VAN DE LOCATIE"]
[null,"Zijn er kwetsbare functies binnen een straal van 200 meter rond de site?","belangrijk","kies",null,{"$f":"IF(D23=\"kies\",3,IF(D23=\"antwoord onbekend\",2,1))","v":3}]
[null,"Welke stedenbouwkundige bestemming heeft de site?","belangrijk","kies",null,{"$f":"IF(D24=\"kies\",3,IF(D24=\"antwoord onbekend\",2,1))","v":3}]
[null,"In welk type buurt ligt de site?","belangrijk","kies",null,3]
[null,"Hoe groot is de site?","belangrijk","kies",null,3]
[null,"Wat is de actuele graad van bebouwde oppervlakte op de site?",null,"kies",null,3]
[null,"Is er onroerend erfgoed op de site aanwezig?",null,"kies",null,3]
[null,"In welke staat is de site vandaag?",null,"kies",null,3]
[null,"Is er op de site voldoende ruimte om te bufferen?","belangrijk","kies",null,3]
[null,"VAN DE GEPLANDE ACTIVITEIT"]
[null,"Wat is de visuele impact van het project op de omgeving?","belangrijk","kies",null,3]
[null,"In welke mate moet de bestaande toestand aan de geplande activiteiten worden aangepast?","belangrijk","kies",null,3]
[null,"Vereisen de geplande activiteiten opslag in open lucht?","belangrijk","kies",null,3]
[null,"Kan het aanwezige erfgoed op de site behouden worden?","belangrijk","kies",null,3]
[]
[null,"SOCIALE KENMERKEN"]
[null,"VAN DE GEPLANDE ACTIVITEIT"]
[null,"Draagt het bedrijf bij tot de uitstraling van de gemeente?","belangrijk","kies",null,{"$f":"IF(D39=\"kies\",3,IF(D39=\"antwoord onbekend\",2,1))","v":3}]
[null,"Heeft het bedrijf een publieksfunctie?","belangrijk","kies",null,3]
{"$rows_left_out":47}
{"sheet":"RESULTAAT","index":2,"n_rows":76,"n_cols":4,"rows_kept":76,"cut":false,"hidden":false,"merged":[[52,1,56,1],[62,1,62,3],[63,1,66,1],[2,1,2,3],[31,1,31,3],[37,1,37,3],[51,1,51,3],[18,1,22,1],[32,1,35,1],[38,1,42,1],[17,1,17,3],[10,1,10,3],[6,1,6,3],[3,2,3,3],[4,2,4,3],[5,2,5,3],[13,2,13,3],[14,2,14,3],[15,2,15,3],[1,1,1,3],[7,2,7,3],[8,2,8,3],[9,2,9,3],[11,2,11,3],[12,2,12,3]]}
[]
[]
[null,"RUIMTELIJK KENMERKEN"]
[null,"Naam dossierbeheerder",{"$f":"INPUT!D7","v":0}]
[null,"Namen betrokken personen",{"$f":"INPUT!D8","v":0}]
[null,"Datum opstart dossier",{"$f":"INPUT!D9","v":"00:00:00"}]
[null,"LOCATIE"]
[null,"Naam",{"$f":"INPUT!D11","v":0}]
[null,"Adres",{"$f":"INPUT!D12","v":0}]
[null,"Huidige eigenaar",{"$f":"INPUT!D13","v":0}]
[null,"GEÏNTERESSEERDE PARTIJ"]
[null,"Naam",{"$f":"INPUT!D15","v":0}]
[null,"Adres",{"$f":"INPUT!D16","v":0}]
[null,"Contactpersoon",{"$f":"INPUT!D17","v":0}]
[null,"Telefoon",{"$f":"INPUT!D18","v":0}]
[null,"Email",{"$f":"INPUT!D19","v":0}]
[]
[null,"RUIMTELIJK KENMERKEN"]
[null,null,{"$f":"DATAVERWERKING!G6","v":1},{"$f":"IF(DATAVERWERKING!D6=\"kies\",\"geen informatie\",VLOOKUP(DATAVERWERKING!D6,Range_vlookup,5,FALSE))","v":"geen informatie"}]
[null,null,{"$f":"DATAVERWERKING!G7","v":1},{"$f":"IF(DATAVERWERKING!D7=\"kies\",\"geen informatie\",VLOOKUP(DATAVERWERKING!D7,Range_vlookup,5,FALSE))","v":"geen informatie"}]
[null,null,{"$f":"DATAVERWERKING!G8","v":1},{"$f":"IF(DATAVERWERKING!D8=\"kies\",\"geen informatie\",VLOOKUP(DATAVERWERKING!D8,Range_vlookup,5,FALSE))","v":"geen informatie"}]
[null,null,{"$f":"DATAVERWERKING!G9","v":1},{"$f":"IF(DATAVERWERKING!D9=\"kies\",\"geen informatie\",VLOOKUP(DATAVERWERKING!D9,Range_vlookup,5,FALSE))","v":"geen informatie"}]
[null,null,null,{"$f":"IF(DATAVERWERKING!D10=\"kies\",\"geen informatie\",VLOOKUP(DATAVERWERKING!D10,Range_vlookup,5,FALSE))","v":"geen informatie"}]
[null,null,null,{"$f":"IF(DATAVERWERKING!D11=\"kies\",\"geen informatie\",VLOOKUP(DATAVERWERKING!D11,Range_vlookup,5,FALSE))","v":"geen informatie"}]
[null,null,null,{"$f":"IF(DATAVERWERKING!D12=\"kies\",\"geen informatie\",VLOOKUP(DATAVERWERKING!D12,Range_vlookup,5,FALSE))","v":"geen informatie"}]
[null,null,{"$f":"DATAVERWERKING!G13","v":1},{"$f":"IF(DATAVERWERKING!D13=\"kies\",\"geen informatie\",VLOOKUP(DATAVERWERKING!D13,Range_vlookup,5,FALSE))","v":"geen informatie"}]
[null,null,{"$f":"DATAVERWERKING!G15","v":1},{"$f":"IF(DATAVERWERKING!D15=\"kies\",\"geen informatie\",VLOOKUP(DATAVERWERKING!D15,Range_vlookup,5,FALSE))","v":"geen informatie"}]
[null,null,{"$f":"DATAVERWERKING!G16","v":1},{"$f":"IF(DATAVERWERKING!D16=\"kies\",\"geen informatie\",VLOOKUP(DATAVERWERKING!D16,Range_vlookup,5,FALSE))","v":"geen informatie"}]
[null,null,{"$f":"DATAVERWERKING!G17","v":1},{"$f":"IF(DATAVERWERKING!D17=\"kies\",\"geen informatie\",VLOOKUP(DATAVERWERKING!D17,Range_vlookup,5,FALSE))","v":"geen informatie"}]
[null,null,{"$f":"DATAVERWERKING!G18","v":1},{"$f":"IF(DATAVERWERKING!D18=\"kies\",\"geen informatie\",VLOOKUP(DATAVERWERKING!D18,Range_vlookup,5,FALSE))","v":"geen informatie"}]
[]
[null,"SOCIALE KENMERKEN"]
[null,null,{"$f":"DATAVERWERKING!G22","v":1},{"$f":"IF(DATAVERWERKING!D22=\"kies\",\"geen informatie\",VLOOKUP(DATAVERWERKING!D22,Range_vlookup,5,FALSE))","v":"geen informatie"}]
[null,null,{"$f":"DATAVERWERKING!G23","v":1},{"$f":"IF(DATAVERWERKING!D23=\"kies\",\"geen informatie\",VLOOKUP(DATAVERWERKING!D23,Range_vlookup,5,FALSE))","v":"geen informatie"}]
[null,null,{"$f":"DATAVERWERKING!G24","v":1},{"$f":"IF(DATAVERWERKING!D24=\"kies\",\"geen informatie\",VLOOKUP(DATAVERWERKING!D24,Range_vlookup,5,FALSE))","v":"geen informatie"}]
[null,null,{"$f":"DATAVERWERKING!G25","v":1},{"$f":"IF(DATAVERWERKING!D25=\"kies\",\"geen informatie\",VLOOKUP(DATAVERWERKING!D25,Range_vlookup,5,FALSE))","v":"geen informatie"}]
[]
[null,"ECONOMISCHE KENMERKEN"]
[null,null,null,{"$f":"IF(DATAVERWERKING!D29=\"kies\",\"geen informatie\",VLOOKUP(DATAVERWERKING!D29,Range_vlookup,5,FALSE))","v":"geen informatie"}]
[null,null,null,{"$f":"IF(DATAVERWERKING!D30=\"kies\",\"geen informatie\",VLOOKUP(DATAVERWERKING!D30,Range_vlookup,5,FALSE))","v":"geen informatie"}]
{"$rows_left_out":37}
{"sheet":"LISTS","index":3,"n_rows":315,"n_cols":5,"rows_kept":315,"cut":false,"hidden":true,"merged":[]}
["R01 - kwestsbare functies"]
["kies",null,0]
["neen, er zijn geen kwestbare functies",null,0,null,"In een straal van 200 meter rond de site zijn er geen kwetsbare functies"]
["ja, er zijn kwetsbare functies",null,5,null,"In een straal van 200 meter zijn er kwetsbare functies"]
["het is niet bekend of er in een straal van 200 meter kwetsbare functies zijn",null,"x",null,"Het is niet bekend of er in een straal van 200 meter kwetsbare functies zijn"]
["R02 - bestemming"]
["kies",null,0]
["industriegebied (paars)",null,0,null,"De site heeft als stedenbouwkundige bestemming \"industriegebied\""]
["woongebied (rood)",null,5,null,"De site heeft als stedenbouwkundige bestemming \"woongebied\""]
["andere",null,5,null,"De site heeft een andere stedenbouwkundige bestemming dan \"industriegebied\" of \"woongebied\""]
["R04 - type buurt"]
["kies",null,0]
["gemengd weefsel langs invalsweg",null,0,null,"De site ligt in het gemengde weefsel langs een invalsweg"]
["19de eeuwse rand",null,2.5,null,"De site ligt in de 19de eeuwse rand"]
["groene / residentiële rand",null,2.5,null,"De site ligt in de groene en residentiële rand"]
["historisch centrum",null,5,null,"De site ligt in het historische centrum"]
["R05 - oppervlakte"]
["kies",null,0]
["< 250 m²",null,0,null,"De site is kleiner dan 250 m²"]
["< 500 m²",null,{"$f":"5/6","v":0.83333333333333337},null,"De site is kleiner dan 500 m²"]
["< 1000 m²",null,{"$f":"C20+5/6","v":1.6666666666666667},null,"De site is kleiner dan 1000 m²"]
["< 2000 m²",null,{"$f":"C21+5/6","v":2.5},null,"De site is kleiner dan 2000 m²"]
["< 5000 m²",null,{"$f":"C22+5/6","v":3.3333333333333335},null,"De site is kleiner dan 5000 m²"]
["< 10.000 m²",null,{"$f":"C23+5/6","v":4.166666666666667},null,"De site is kleiner dan 10.000 m²"]
["> 10.000 m²",null,{"$f":"C24+5/6","v":5},null,"De site is groter dan 10.000 m²"]
["R06 - bebouwingsgraad"]
["kies"]
["circa 0 procent",null,null,null,"De site is niet bebouwd"]
["circa 25 procent",null,null,null,"De site is voor ongeveer 25 procent bebouwd"]
["circa 50 procent",null,null,null,"De site is voor ongeveer de helft bebouwd"]
["circa 75 procent",null,null,null,"De site is voor ongeveer 75 procent bebouwd"]
["circa 100 procent",null,null,null,"De site is volledig bebouwd"]
["de bebouwingsgraad van de site is niet bekend",null,null,null,"De bebouwingsgraad van de site is niet bekend"]
["R07 - aanwezigheid erfgoed"]
["kies"]
["ja, er is erfgoed aanwezig",null,null,null,"Op de site is er onroerend erfgoed aanwezig"]
["neen, er is geen erfgoed aanwezig",null,null,null,"Op de site is er geen onroerend erfgoed aanwezig"]
["het is niet bekend of er op de site onroerend erfgoed aanwezig is",null,null,null,"Het is niet bekend of er op de site onroerend erfgoed aanwezig is"]
["R08 - staat van de site"]
["kies"]
{"$rows_left_out":276}
{"sheet":"DATAVERWERKING","index":4,"n_rows":70,"n_cols":15,"rows_kept":70,"cut":false,"hidden":true,"merged":[[55,9,68,9],[5,9,17,9],[21,9,24,9],[28,9,39,9],[43,9,51,9]]}
[]
[]
[]
[null,{"$f":"INPUT!B21","v":"RUIMTELIJK KENMERKEN"}]
[null,{"$f":"INPUT!B22","v":"VAN DE LOCATIE"},null,null,null,"score","belang","totaal"]
[null,{"$f":"INPUT!B23","v":"Zijn er kwetsbare functies binnen een straal van 200 meter rond de site?"},{"$f":"INPUT!C23","v":"belangrijk"},{"$f":"INPUT!D23","v":"kies"},null,{"$f":"VLOOKUP(D6,Range_vlookup,3,FALSE)","v":0},{"$f":"VLOOKUP(C6,Range_vlookup,3,FALSE)","v":1},{"$f":"IF(F6=\"x\",\"x\",F6*G6)","v":0},null,{"$f":"H19*(D19/G19)/D19","v":0},null,null,"schaal","verdeling","score"]
[null,{"$f":"INPUT!B24","v":"Welke stedenbouwkundige bestemming heeft de site?"},{"$f":"INPUT!C24","v":"belangrijk"},{"$f":"INPUT!D24","v":"kies"},null,{"$f":"VLOOKUP(D7,Range_vlookup,3,FALSE)","v":0},{"$f":"VLOOKUP(C7,Range_vlookup,3,FALSE)","v":1},{"$f":"IF(F7=\"x\",\"x\",F7*G7)","v":0},null,null,null,null,0,20,{"$f":"J6/5","v":0}]
[null,{"$f":"INPUT!B25","v":"In welk type buurt ligt de site?"},{"$f":"INPUT!C25","v":"belangrijk"},{"$f":"INPUT!D25","v":"kies"},null,{"$f":"VLOOKUP(D8,Range_vlookup,3,FALSE)","v":0},{"$f":"VLOOKUP(C8,Range_vlookup,3,FALSE)","v":1},0,null,null,null,null,1,20,0.02]
[null,{"$f":"INPUT!B26","v":"Hoe groot is de site?"},{"$f":"INPUT!C26","v":"belangrijk"},{"$f":"INPUT!D26","v":"kies"},null,{"$f":"VLOOKUP(D9,Range_vlookup,3,FALSE)","v":0},{"$f":"VLOOKUP(C9,Range_vlookup,3,FALSE)","v":1},0,null,null,null,null,2,20,{"$f":"O12-O8-O7","v":0.98}]
[null,{"$f":"INPUT!B27","v":"Wat is de actuele graad van bebouwde oppervlakte op de site?"},null,{"$f":"INPUT!D27","v":"kies"},null,null,null,null,null,null,null,null,3,20,0]
[null,{"$f":"INPUT!B28","v":"Is er onroerend erfgoed op de site aanwezig?"},null,{"$f":"INPUT!D28","v":"kies"},null,null,null,null,null,null,null,null,4,20,0]
[null,{"$f":"INPUT!B29","v":"In welke staat is de site vandaag?"},null,{"$f":"INPUT!D29","v":"kies"},null,null,null,null,null,null,null,null,5,100,1]
[null,{"$f":"INPUT!B30","v":"Is er op de site voldoende ruimte om te bufferen?"},{"$f":"INPUT!C30","v":"belangrijk"},{"$f":"INPUT!D30","v":"kies"},null,{"$f":"VLOOKUP(D13,Range_vlookup,3,FALSE)","v":0},{"$f":"VLOOKUP(C13,Range_vlookup,3,FALSE)","v":1},0]
[null,{"$f":"INPUT!B31","v":"VAN DE GEPLANDE ACTIVITEIT"}]
[null,{"$f":"INPUT!B32","v":"Wat is de visuele impact van het project op de omgeving?"},{"$f":"INPUT!C32","v":"belangrijk"},{"$f":"INPUT!D32","v":"kies"},null,{"$f":"VLOOKUP(D15,Range_vlookup,3,FALSE)","v":0},{"$f":"VLOOKUP(C15,Range_vlookup,3,FALSE)","v":1},0]
[null,{"$f":"INPUT!B33","v":"In welke mate moet de bestaande toestand aan de geplande activiteiten worden aangepast?"},{"$f":"INPUT!C33","v":"belangrijk"},{"$f":"INPUT!D33","v":"kies"},null,{"$f":"VLOOKUP(D16,Range_vlookup,3,FALSE)","v":0},{"$f":"VLOOKUP(C16,Range_vlookup,3,FALSE)","v":1},0]
[null,{"$f":"INPUT!B34","v":"Vereisen de geplande activiteiten opslag in open lucht?"},{"$f":"INPUT!C34","v":"belangrijk"},{"$f":"INPUT!D34","v":"kies"},null,{"$f":"VLOOKUP(D17,Range_vlookup,3,FALSE)","v":0},{"$f":"VLOOKUP(C17,Range_vlookup,3,FALSE)","v":1},0]
[null,{"$f":"INPUT!B35","v":"Kan het aanwezige erfgoed op de site behouden worden?"},{"$f":"INPUT!C35","v":"belangrijk"},{"$f":"INPUT!D35","v":"kies"},null,{"$f":"VLOOKUP(D18,Range_vlookup,3,FALSE)","v":0},{"$f":"VLOOKUP(C18,Range_vlookup,3,FALSE)","v":1},0]
[null,null,null,{"$f":"IF(D11=LISTS!A36,9,8)","v":8},null,{"$f":"SUM(F6:F18)","v":0},{"$f":"SUM(G6:G18)","v":9},{"$f":"SUM(H6:H18)","v":0}]
[null,{"$f":"INPUT!B37","v":"SOCIALE KENMERKEN"}]
[null,{"$f":"INPUT!B38","v":"VAN DE GEPLANDE ACTIVITEIT"},null,null,null,null,null,null,null,null,null,null,"schaal","verdeling","score"]
[null,{"$f":"INPUT!B39","v":"Draagt het bedrijf bij tot de uitstraling van de gemeente?"},{"$f":"INPUT!C39","v":"belangrijk"},{"$f":"INPUT!D39","v":"kies"},null,{"$f":"VLOOKUP(D22,Range_vlookup,3,FALSE)","v":0},{"$f":"VLOOKUP(C22,Range_vlookup,3,FALSE)","v":1},{"$f":"IF(F22=\"x\",\"x\",F22*G22)","v":0},null,{"$f":"H26/G26","v":0},null,null,0,20,{"$f":"J22/5","v":0}]
[null,{"$f":"INPUT!B40","v":"Heeft het bedrijf een publieksfunctie?"},{"$f":"INPUT!C40","v":"belangrijk"},{"$f":"INPUT!D40","v":"kies"},null,{"$f":"VLOOKUP(D23,Range_vlookup,3,FALSE)","v":0},{"$f":"VLOOKUP(C23,Range_vlookup,3,FALSE)","v":1},0,null,null,null,null,1,20,0.02]
[null,{"$f":"INPUT!B41","v":"Is een gedeeld gebruik van delen van de bedrijfssite mogelijk en bespreekbaar?"},{"$f":"INPUT!C41","v":"belangrijk"},{"$f":"INPUT!D41","v":"kies"},null,{"$f":"VLOOKUP(D24,Range_vlookup,3,FALSE)","v":0},{"$f":"VLOOKUP(C24,Range_vlookup,3,FALSE)","v":1},0,null,null,null,null,2,20,{"$f":"O27-O23-O22","v":0.98}]
[null,{"$f":"INPUT!B42","v":"Komt de zaakvoerder of een  conciërge bij het bedrijf wonen?"},{"$f":"INPUT!C42","v":"belangrijk"},{"$f":"INPUT!D42","v":"kies"},null,{"$f":"VLOOKUP(D25,Range_vlookup,3,FALSE)","v":0},{"$f":"VLOOKUP(C25,Range_vlookup,3,FALSE)","v":1},0,null,null,null,null,3,20,0]
[null,null,null,{"$f":"IF(D18=LISTS!A43,9,8)","v":8},null,{"$f":"SUM(F22:F25)","v":0},{"$f":"SUM(G22:G25)","v":4},{"$f":"SUM(H22:H25)","v":0},null,null,null,null,4,20,0]
[null,{"$f":"INPUT!B44","v":"ECONOMISCHE KENMERKEN"},null,null,null,null,null,null,null,null,null,null,5,100,1]
[null,{"$f":"INPUT!B45","v":"VAN DE GEPLANDE ACTIVITEIT"}]
[null,{"$f":"INPUT!B46","v":"Tot welke economische sector behoort het bedrijf?"},null,{"$f":"INPUT!D46","v":"kies"},null,null,null,null,null,{"$f":"IF(H41<0,0,H41/G41)","v":0}]
[null,{"$f":"INPUT!B47","v":"Is de belangrijkste doelgroep van het bedrijf particulieren (B2C) of professionelen (B2B)"},null,{"$f":"INPUT!D47","v":"kies"}]
[null,{"$f":"INPUT!B48","v":"Laat de onderneming zich binnen een regionaal clusterbeleid inschrijven?"},{"$f":"INPUT!C48","v":"belangrijk"},{"$f":"INPUT!D48","v":"kies"},null,{"$f":"VLOOKUP(D31,Range_vlookup,3,FALSE)","v":0},{"$f":"VLOOKUP(C31,Range_vlookup,3,FALSE)","v":1},{"$f":"IF(F31=\"x\",\"x\",F31*G31)","v":0},null,null,null,null,"schaal","verdeling","score"]
[null,{"$f":"INPUT!B49","v":"In welke mate hangt het bedrijf af van lokale (dus nabije) leveranciers?"},{"$f":"INPUT!C49","v":"belangrijk"},{"$f":"INPUT!D49","v":"kies"},null,0,1,0,null,null,null,null,0,20,{"$f":"J29/5","v":0}]
[null,{"$f":"INPUT!B50","v":"In welke mate hangt het bedrijf af van lokale (dus nabije) klanten? "},{"$f":"INPUT!C50","v":"belangrijk"},{"$f":"INPUT!D50","v":"kies"},null,0,1,0,null,null,null,null,1,20,0.02]
[null,{"$f":"INPUT!B51","v":"Welke betekenis hebben de geplande investeringen van het bedrijf?"},{"$f":"INPUT!C51","v":"belangrijk"},{"$f":"INPUT!D51","v":"kies"},null,0,1,0,null,null,null,null,2,20,{"$f":"O37-O33-O32","v":0.98}]
[null,{"$f":"INPUT!B52","v":"Betreft het een nieuw bedrijf, of de uitbreiding of verhuis van een bestaand bedrijf?"},{"$f":"INPUT!C52","v":"belangrijk"},{"$f":"INPUT!D52","v":"kies"},null,0,1,{"$f":"IF(F35=\"x\",\"x\",F35*G35)","v":0},null,null,null,null,3,20,0]
[null,{"$f":"INPUT!B53","v":"Hoeveel (bijkomende) tewerkstelling brengt de investering met zich mee?"},{"$f":"INPUT!C53","v":"belangrijk"},{"$f":"INPUT!D53","v":"kies"},null,0,1,0,null,null,null,null,4,20,0]
[null,{"$f":"INPUT!B54","v":"Hoeveel groeimarge heeft de investering binnen het terrein op basis van actuele groeicijfers?"},{"$f":"INPUT!C54","v":"belangrijk"},{"$f":"INPUT!D54","v":"kies"},null,0,1,0,null,null,null,null,5,100,1]
[null,{"$f":"INPUT!B55","v":"Wat betekent de investering op vlak van gemeentelijke inkomsten?"},{"$f":"INPUT!C55","v":"belangrijk"},{"$f":"INPUT!D55","v":"kies"},null,0,1,0]
[null,{"$f":"INPUT!B56","v":"Zijn er investeringen nodig vanuit de stad of gemeente om de investering te faciliteren?"},{"$f":"INPUT!C56","v":"belangrijk"},{"$f":"INPUT!D56","v":"kies"},null,0,1,0]
[null,{"$f":"INPUT!B57","v":"Hoe groot is de kans op schade aan en/of slijtage van het publieke domein tijdens de exploitatie"},{"$f":"INPUT!C57","v":"belangrijk"},{"$f":"INPUT!D57","v":"kies"},null,0,1,0]
{"$rows_left_out":30}